O2CNO-

Vibrational and/or electronic energy levels

Data compiled by: Marilyn E. Jacox

State:   X

Vib.
sym.
 No.   Approximate
 type of mode
 cm-1   Med.   Method   References

a' 1 NO stretch 1495.8 Ar IR Zhou, Zhang, et al., 2000
2 CO2 s-stretch 1310.4 Ar IR Zhou, Zhang, et al., 2000
a CO2 a-stretch 1713.6 Ar IR Zhou, Zhang, et al., 2000

Additional references: Jacox, 2003, page 299

References

Zhou, Zhang, et al., 2000
Zhou, M.; Zhang, L.; Qin, Q., The CO, J. Am. Chem. Soc., 2000, 122, 18, 4483, https://doi.org/10.1021/ja000041v . [all data]

Jacox, 2003
Jacox, M.E., Vibrational and electronic energy levels of polyatomic transient molecules: supplement B, J. Phys. Chem. Ref. Data, 2003, 32, 1, 1-441, https://doi.org/10.1063/1.1497629 . [all data]