CH3CdH

Vibrational and/or electronic energy levels

Data compiled by: Marilyn E. Jacox

State:   X

Vib.
sym.
 No.   Approximate
 type of mode
 cm-1   Med.   Method   References

a1 1 CH3 stretch 2928.5 Ar IR Greene, Andrews, et al., 1995
2 CdH stretch 1760.5 Ar IR Greene, Andrews, et al., 1995
4 CdC stretch 508.6 Ar IR Greene, Andrews, et al., 1995
e 7 CH3 rock 687.3 Ar IR Greene, Andrews, et al., 1995
7 CH3 rock 685.4 Ar IR Greene, Andrews, et al., 1995
8 CCdH deform. 433.2 Ar IR Greene, Andrews, et al., 1995
8 CCdH deform. 430.1 Ar IR Greene, Andrews, et al., 1995

Additional references: Jacox, 1998, page 309

References

Greene, Andrews, et al., 1995
Greene, T.M.; Andrews, L.; Downs, A.J., The Reaction of Zinc, Cadmium, and Mercury Atoms with Methane: Infrared Spectra of the Matrix-Isolated Methylmetal Hydrides, J. Am. Chem. Soc., 1995, 117, 31, 8180, https://doi.org/10.1021/ja00136a015 . [all data]

Jacox, 1998
Jacox, M.E., Vibrational and electronic energy levels of polyatomic transient molecules: supplement A, J. Phys. Chem. Ref. Data, 1998, 27, 2, 115-393, https://doi.org/10.1063/1.556017 . [all data]