Cl3TiOCH3

Vibrational and/or electronic energy levels

Data compiled by: Marilyn E. Jacox

State:   X

Vib.
sym.
 No.   Approximate
 type of mode
 cm-1   Med.   Method   References

CH3 stretch 3006 Ar IR Ault and Everhart, 1996
CH3 stretch 2945 Ar IR Ault and Everhart, 1996
CH3 deform. 1449 Ar IR Ault and Everhart, 1996
C-O stretch 1152 vs Ar IR Ault and Everhart, 1996
CH3 rock 1109 Ar IR Ault and Everhart, 1996
CH3 rock 1095 Ar IR Ault and Everhart, 1996
TiO stretch 636 Ar IR Ault and Everhart, 1996
TiCl stretch 486 vs Ar IR Ault and Everhart, 1996

Additional references: Jacox, 2003, page 390

References

Ault and Everhart, 1996
Ault, B.S.; Everhart, J.B., Matrix Isolation Study of the Reaction of TiCl, J. Phys. Chem., 1996, 100, 39, 15726, https://doi.org/10.1021/jp961530d . [all data]

Jacox, 2003
Jacox, M.E., Vibrational and electronic energy levels of polyatomic transient molecules: supplement B, J. Phys. Chem. Ref. Data, 2003, 32, 1, 1-441, https://doi.org/10.1063/1.1497629 . [all data]