CH3NB
- Formula: CH3BN
- Molecular weight: 39.852

Vibrational and/or electronic energy levels

Data compiled by: Marilyn E. Jacox
State: X
Vib. sym. |
No. | Approximate type of mode |
cm-1 | Med. | Method | References | |
---|---|---|---|---|---|---|---|
NB stretch | 1981.1 | Ar | IR | Lanzisera and Andrews, 1997 | |||
Additional references: Jacox, 2003, page 314

References

Lanzisera and Andrews, 1997
Lanzisera, D.V.; Andrews, L.,
Reactions of Laser-Ablated Boron Atoms with Methylamines. Matrix Infrared Spectra and MP2 Frequency Calculations for Isotopic Product Molecules,
J. Phys. Chem. A, 1997, 101, 5, 824, https://doi.org/10.1021/jp962772g
. [all data]
Jacox, 2003
Jacox, M.E.,
Vibrational and electronic energy levels of polyatomic transient molecules: supplement B,
J. Phys. Chem. Ref. Data, 2003, 32, 1, 1-441, https://doi.org/10.1063/1.1497629
. [all data]