HNiCO-

Vibrational and/or electronic energy levels

Data compiled by: Marilyn E. Jacox

State:   ?

 Energy
 (cm-1
 Med.   Transition   λmin
 (nm)
 λmax
 (nm)

References

Td = 17150 ± 80 gas Chatterjee, Akin, et al., 2003

State:   X

Vib.
sym.
 No.   Approximate
 type of mode
 cm-1   Med.   Method   References

3 NiC stretch 530 ± 50 T gas PE Chatterjee, Akin, et al., 2003

Chatterjee, Akin, et al., 2003
Chatterjee, B.; Akin, F.A.; Jarrold, C.C.; Raghavachari, K., A comparison of stable carbonyls formed in the gas-phase reaction between group 10 atomic anions and methanol or methoxy radicals: Anion photoelectron spectroscopy and density functional theory calculations on HNiCO[sup -], PdCO[sup -], and PtCO[sup -], J. Chem. Phys., 2003, 119, 20, 10591, https://doi.org/10.1063/1.1619131 . [all data]