HNiCO

Vibrational and/or electronic energy levels

Data compiled by: Marilyn E. Jacox

State:   X

Vib.
sym.
 No.   Approximate
 type of mode
 cm-1   Med.   Method   References

1 CO stretch 2030 ± 10 gas PE Chatterjee, Akin, et al., 2003
3 NiC stretch 430 ± 10 gas PE Chatterjee, Akin, et al., 2003

References

Chatterjee, Akin, et al., 2003
Chatterjee, B.; Akin, F.A.; Jarrold, C.C.; Raghavachari, K., A comparison of stable carbonyls formed in the gas-phase reaction between group 10 atomic anions and methanol or methoxy radicals: Anion photoelectron spectroscopy and density functional theory calculations on HNiCO[sup -], PdCO[sup -], and PtCO[sup -], J. Chem. Phys., 2003, 119, 20, 10591, https://doi.org/10.1063/1.1619131 . [all data]