BeBeCO

Vibrational and/or electronic energy levels

Data compiled by: Marilyn E. Jacox

State:   X

Vib.
sym.
 No.   Approximate
 type of mode
 cm-1   Med.   Method   References

CO stretch 1943.6 Ar IR Andrews, Tague, et al., 1995
483.3 Ar IR Andrews, Tague, et al., 1995

Additional references: Jacox, 1998, page 241

References

Andrews, Tague, et al., 1995
Andrews, L.; Tague, T.J., Jr.; Kushto, G.P.; Davy, R.D., Infrared Spectra of Beryllium Carbonyls from Reactions of Beryllium Atoms with Carbon Monoxide in Solid Argon, Inorg. Chem., 1995, 34, 11, 2952, https://doi.org/10.1021/ic00115a024 . [all data]

Jacox, 1998
Jacox, M.E., Vibrational and electronic energy levels of polyatomic transient molecules: supplement A, J. Phys. Chem. Ref. Data, 1998, 27, 2, 115-393, https://doi.org/10.1063/1.556017 . [all data]