AgCO+

Vibrational and/or electronic energy levels

Data compiled by: Marilyn E. Jacox

State:   X

Vib.
sym.
 No.   Approximate
 type of mode
 cm-1   Med.   Method   References

1 CO stretch 2233.1 Ne IR Liang and Andrews, 2000

Additional references: Jacox, 2003, page 62

References

Liang and Andrews, 2000
Liang, B.; Andrews, L., Reactions of Laser-Ablated Ag and Au Atoms with Carbon Monoxide: Matrix Infrared Spectra and Density Functional Calculations on Ag(CO), J. Phys. Chem. A, 2000, 104, 40, 9156, https://doi.org/10.1021/jp001833e . [all data]

Jacox, 2003
Jacox, M.E., Vibrational and electronic energy levels of polyatomic transient molecules: supplement B, J. Phys. Chem. Ref. Data, 2003, 32, 1, 1-441, https://doi.org/10.1063/1.1497629 . [all data]