NN(cyc-BeN2)

Vibrational and/or electronic energy levels

Data compiled by: Marilyn E. Jacox

State:   X

Vib.
sym.
 No.   Approximate
 type of mode
 cm-1   Med.   Method   References

1691.8 Ar IR Thompson, Andrews, et al., 1995
1682.9 N2 IR Thompson, Andrews, et al., 1995
928.4 N2 IR Thompson, Andrews, et al., 1995

Additional references: Jacox, 1998, page 294

References

Thompson, Andrews, et al., 1995
Thompson, C.A.; Andrews, L.; Davy, R.D., Reactions of Beryllium Species with N2: Infrared Spectra and Quantum Chemical Calculations of Beryllium Dinitrogen Complexes in Solid Argon and Nitrogen, J. Phys. Chem., 1995, 99, 20, 7913, https://doi.org/10.1021/j100020a013 . [all data]

Jacox, 1998
Jacox, M.E., Vibrational and electronic energy levels of polyatomic transient molecules: supplement A, J. Phys. Chem. Ref. Data, 1998, 27, 2, 115-393, https://doi.org/10.1063/1.556017 . [all data]