B5-

Vibrational and/or electronic energy levels

Data compiled by: Marilyn E. Jacox

State:   ?

 Energy
 (cm-1
 Med.   Transition   λmin
 (nm)
 λmax
 (nm)

References

Td = 18800 ± 160 gas Zhai, Wang, et al., 2002

State:   X

Vib.
sym.
 No.   Approximate
 type of mode
 cm-1   Med.   Method   References

a1 4 680 ± 60 gas PE Zhai, Wang, et al., 2002

Zhai, Wang, et al., 2002
Zhai, H.-J.; Wang, L.-S.; Alexandrova, A.N.; Boldyrev, A.I., Electronic structure and chemical bonding of B[sub 5]-] and B[sub 5] by photoelectron spectroscopy and ab initio calculations, J. Chem. Phys., 2002, 117, 17, 7917, https://doi.org/10.1063/1.1511184 . [all data]