BNBB

Vibrational and/or electronic energy levels

Data compiled by: Marilyn E. Jacox

State:   5S-

 Energy
 (cm-1
 Med.   Transition   λmin
 (nm)
 λmax
 (nm)

References

To = 7790 ± 160 gas Asmis, Taylor, et al., 1999
Asmis, Taylor, et al., 1999, 2

Vib.
sym.
 No.   Approximate
 type of mode
 cm-1   Med.   Method   References

Σ+ 1879 ± 60 gas PE Asmis, Taylor, et al., 1999
Asmis, Taylor, et al., 1999, 2
1403 ± 60 gas PE Asmis, Taylor, et al., 1999, 2

State:   3Π

 Energy
 (cm-1
 Med.   Transition   λmin
 (nm)
 λmax
 (nm)

To = 6660 ± 110 gas Asmis, Taylor, et al., 1999
Asmis, Taylor, et al., 1999, 2

Vib.
sym.
 No.   Approximate
 type of mode
 cm-1   Med.   Method   References

Σ+ 1863 ± 60 gas PE Asmis, Taylor, et al., 1999
Asmis, Taylor, et al., 1999, 2
758 ± 60 gas PE Asmis, Taylor, et al., 1999
Asmis, Taylor, et al., 1999, 2

Additional references: Jacox, 2003, page 207

Asmis, Taylor, et al., 1999
Asmis, K.R.; Taylor, T.R.; Neumark, D.M., Anion Photoelectron Spectroscopy of Small Boron Nitride Clusters: Adiabatic Detachment Energies and Vibrational Frequencies of Low-lying Electronic States in B2N and B3N, Eur. Phys. J. D, 1999, 9, 1, 257, https://doi.org/10.1007/s100530050436 . [all data]

Asmis, Taylor, et al., 1999, 2
Asmis, K.R.; Taylor, T.R.; Neumark, D.M., Anion photoelectron spectroscopy of B[sub 3]N[sup -], J. Chem. Phys., 1999, 111, 23, 10491, https://doi.org/10.1063/1.480402 . [all data]

Jacox, 2003
Jacox, M.E., Vibrational and electronic energy levels of polyatomic transient molecules: supplement B, J. Phys. Chem. Ref. Data, 2003, 32, 1, 1-441, https://doi.org/10.1063/1.1497629 . [all data]