cyc-(BN)2

Vibrational and/or electronic energy levels

Data compiled by: Marilyn E. Jacox

State:   X

Vib.
sym.
 No.   Approximate
 type of mode
 cm-1   Med.   Method   References

b2u 1029.2 N2 IR Hassanzadeh and Andrews, 1992

Additional references: Jacox, 1994, page 181

References

Hassanzadeh and Andrews, 1992
Hassanzadeh, P.; Andrews, L., Pulsed laser-assisted reactions of boron and nitrogen atoms in a condensing nitrogen stream, J. Phys. Chem., 1992, 96, 23, 9177, https://doi.org/10.1021/j100202a020 . [all data]

Jacox, 1994
Jacox, M.E., Vibrational and electronic energy levels of polyatomic transient molecules, American Chemical Society, Washington, DC, 1994, 464. [all data]