Al3O3

Vibrational and/or electronic energy levels

Data compiled by: Marilyn E. Jacox

State:   B

 Energy
 (cm-1
 Med.   Transition   λmin
 (nm)
 λmax
 (nm)

References

To = 18560 ± 800 gas Wu, Li, et al., 1998

State:   A

 Energy
 (cm-1
 Med.   Transition   λmin
 (nm)
 λmax
 (nm)

To = 6450 ± 440 gas Wu, Li, et al., 1998

State:   X

Vib.
sym.
 No.   Approximate
 type of mode
 cm-1   Med.   Method   References

610 ± 60 gas PE Wu, Li, et al., 1998

Additional references: Jacox, 2003, page 329; Ghanty and Davidson, 1999

Wu, Li, et al., 1998
Wu, H.; Li, X.; Wang, X.-B.; Ding, C.-F.; Wang, L.-S., Al3Oy (y=0-5) Clusters: Sequential Oxidation, Metal-to-oxide Transformation, and Photoisomerization., J. Chem. Phys., 1998, 109, 2, 449, https://doi.org/10.1063/1.476583 . [all data]

Jacox, 2003
Jacox, M.E., Vibrational and electronic energy levels of polyatomic transient molecules: supplement B, J. Phys. Chem. Ref. Data, 2003, 32, 1, 1-441, https://doi.org/10.1063/1.1497629 . [all data]

Ghanty and Davidson, 1999
Ghanty, T.K.; Davidson, E.R., Theoretical Interpretation of the Photoelectron Spectra of Al, J. Phys. Chem. A, 1999, 103, 45, 8985, https://doi.org/10.1021/jp9925839 . [all data]