AlNNN

Vibrational and/or electronic energy levels

Data compiled by: Marilyn E. Jacox

State:   X

Vib.
sym.
 No.   Approximate
 type of mode
 cm-1   Med.   Method   References

Σ+ 1 N3 a-stretch 2144.0 N2 IR Andrews, Zhou, et al., 2000
2 N3 s-stretch 1386.0 N2 IR Andrews, Zhou, et al., 2000
3 AlN stretch 509.7 N2 IR Andrews, Zhou, et al., 2000

Additional references: Jacox, 2003, page 222

References

Andrews, Zhou, et al., 2000
Andrews, L.; Zhou, M.; Chertihin, G.V.; Bare, W.D.; Hannachi, Y., Reactions of Laser-Ablated Aluminum Atoms with Nitrogen Atoms and Molecules. Infrared Spectra and Density Functional Calculations for the AlN, J. Phys. Chem. A, 2000, 104, 8, 1656, https://doi.org/10.1021/jp993517+ . [all data]

Jacox, 2003
Jacox, M.E., Vibrational and electronic energy levels of polyatomic transient molecules: supplement B, J. Phys. Chem. Ref. Data, 2003, 32, 1, 1-441, https://doi.org/10.1063/1.1497629 . [all data]