HAlNH2

Vibrational and/or electronic energy levels

Data compiled by: Marilyn E. Jacox

State:   X

Vib.
sym.
 No.   Approximate
 type of mode
 cm-1   Med.   Method   References

a' 1 NH2 s-stretch 3476.4 Ar IR Himmel, Downs, et al., 2000
3 AlH stretch 1761.7 Ar IR Lanzisera and Andrews, 1997
Himmel, Downs, et al., 2000
4 NH2 scissors 1533.6 Ar IR Lanzisera and Andrews, 1997
Himmel, Downs, et al., 2000
5 AlN stretch 778.7 Ar IR Lanzisera and Andrews, 1997
Himmel, Downs, et al., 2000
6 Deformation 705.2 Ar IR Lanzisera and Andrews, 1997
Himmel, Downs, et al., 2000
7 AlH deform. 482.2 Ar IR Himmel, Downs, et al., 2000
a 8 NH2 OPLA 483.8 Ar IR Himmel, Downs, et al., 2000
9 AlH OPLA 393.8 Ar IR Himmel, Downs, et al., 2000

Additional references: Jacox, 2003, page 252

References

Himmel, Downs, et al., 2000
Himmel, H.-J.; Downs, A.J.; Greene, T.M., Thermal and Photochemical Reactions of Aluminum, Gallium, and Indium Atoms (M) in the Presence of Ammonia: Generation and Characterization of the Species M·NH, J. Am. Chem. Soc., 2000, 122, 40, 9793, https://doi.org/10.1021/ja001313x . [all data]

Lanzisera and Andrews, 1997
Lanzisera, D.V.; Andrews, L., Reactions of Laser-Ablated Aluminum Atoms with Ammonia. Infrared Spectra of HAlNH, J. Phys. Chem. A, 1997, 101, 28, 5082, https://doi.org/10.1021/jp970560t . [all data]

Jacox, 2003
Jacox, M.E., Vibrational and electronic energy levels of polyatomic transient molecules: supplement B, J. Phys. Chem. Ref. Data, 2003, 32, 1, 1-441, https://doi.org/10.1063/1.1497629 . [all data]