BrAl(O2)2

Vibrational and/or electronic energy levels

Data compiled by: Marilyn E. Jacox

State:   X

Vib.
sym.
 No.   Approximate
 type of mode
 cm-1   Med.   Method   References

a1 2 618.3 Ar IR Bahlo, Himmel, et al., 2002
b2 11 691.6 Ar IR Bahlo, Himmel, et al., 2002

References

Bahlo, Himmel, et al., 2002
Bahlo, J.; Himmel, H.-J.; Schnockel, H., Characterization of the Side-On Coordinated Bissuperoxo Complexes of Aluminum FAl(O, Inorg. Chem., 2002, 41, 17, 4488, https://doi.org/10.1021/ic020208g . [all data]