Benzene, 1,1'-(oxydiethylidene)bis-

Phase change data

Data compiled as indicated in comments:
TRC - Thermodynamics Research Center, NIST Boulder Laboratories, Chris Muzny director
AC - William E. Acree, Jr., James S. Chickos

Quantity Value Units Method Reference Comment
Tboil450.15KN/AMastagli and de Fournas, 1959Uncertainty assigned by TRC = 3. K; TRC

Enthalpy of vaporization

ΔvapH (kJ/mol) Temperature (K) Method Reference Comment
62.1384.AStephenson and Malanowski, 1987Based on data from 369. - 554. K. See also Stull, 1947.; AC

In addition to the Thermodynamics Research Center (TRC) data available from this site, much more physical and chemical property data is available from the following TRC products:

References

Mastagli and de Fournas, 1959
Mastagli, P.; de Fournas, C., Dehyrdrating Action of Liquid Phase Tungstic Acid on Primary, Scondary, and Tertiary Alcohols, C. R. Hebd. Seances Acad. Sci., 1959, 248, 1352. [all data]

Stephenson and Malanowski, 1987
Stephenson, Richard M.; Malanowski, Stanislaw, Handbook of the Thermodynamics of Organic Compounds, 1987, https://doi.org/10.1007/978-94-009-3173-2 . [all data]

Stull, 1947
Stull, Daniel R., Vapor Pressure of Pure Substances. Organic and Inorganic Compounds, Ind. Eng. Chem., 1947, 39, 4, 517-540, https://doi.org/10.1021/ie50448a022 . [all data]