Benzeneacetaldehyde, α-methyl-
- Formula: C9H10O
- Molecular weight: 134.1751
- IUPAC Standard InChIKey: IQVAERDLDAZARL-UHFFFAOYSA-N
- CAS Registry Number: 93-53-8
- Chemical structure:
View 3d structure (requires JavaScript / HTML 5) - Species with the same structure:
- Other names: Hydratropaldehyde; α-Formylethylbenzene; α-Methyl-α-toluic aldehyde; α-Phenylpropionaldehyde; Cumene aldehyde; Hyacinthal; Hydratropa aldehyde; Hydratropic aldehyde; Hydrotropic aldehyde; 2-Phenylpropanal; 2-Phenylpropionaldehyde; α-Methylphenylacetaldehyde; α-Tolualdehyde, α-methyl-; Propionaldehyde, 2-phenyl-; Aldehyd hydratropovy; 2-Fenyl-1-propanal; 2-Phenyl-1-propanal; Benzene, (1-formylethyl)-; (.+/-.)-Hydratropic aldehyde; NSC 5231

Phase change data

Data compiled as indicated in comments:
BS - Robert L. Brown and Stephen E. Stein
AC - William E. Acree, Jr., James S. Chickos
Quantity | Value | Units | Method | Reference | Comment |
---|---|---|---|---|---|
Tboil | 474. to 477. | K | N/A | Frinton Laboratories Inc., 1986 | BS |
Enthalpy of vaporization
ΔvapH (kJ/mol) | Temperature (K) | Method | Reference | Comment |
---|---|---|---|---|
52.3 ± 0.2 | 360. | EB | Steele, Chirico, et al., 2002 | Based on data from 364. to 517. K.; AC |
49.4 ± 0.2 | 400. | EB | Steele, Chirico, et al., 2002 | Based on data from 364. to 517. K.; AC |
46.6 ± 0.3 | 440. | EB | Steele, Chirico, et al., 2002 | Based on data from 364. to 517. K.; AC |
43.4 ± 0.5 | 480. | EB | Steele, Chirico, et al., 2002 | Based on data from 364. to 517. K.; AC |

Kovats' RI, non-polar column, isothermal

Column type | Active phase | Temperature (C) | I | Reference | Comment |
---|---|---|---|---|---|
Capillary | SE-30 | 100. | 1083.9 | Tudor, 1997 | 40. m/0.35 mm/0.35 μm |

Van Den Dool and Kratz RI, non-polar column, temperature ramp

Column type | Active phase | I | Reference | Comment |
---|---|---|---|---|
Capillary | SE-54 | 1093.6 | Shapi and Hesso, 1990 | 25. m/0.32 mm/0.15 μm, He, 40. C @ 1. min, 5. K/min, 280. C @ 15. min |
Packed | SE-30 | 1080. | van den Dool and Kratz, 1963 | Celite; Tstart: 75. C; Tend: 228. C |

Van Den Dool and Kratz RI, polar column, temperature ramp

Column type | Active phase | I | Reference | Comment |
---|---|---|---|---|
Capillary | CP-WAX 57CB | 1612. | Baltes and Mevissen, 1988 | He, 50. C @ 5. min, 2. K/min; Column length: 50. m; Column diameter: 0.24 mm; Tend: 210. C |
Packed | Carbowax 20M | 1631. | van den Dool and Kratz, 1963 | Celite 545, 4.6 K/min; Tstart: 75. C; Tend: 228. C |

Normal alkane RI, non-polar column, temperature ramp

Column type | Active phase | I | Reference | Comment |
---|---|---|---|---|
Packed | SE-30 | 1090. | Khudobina and Zenkevich, 1984 | Helium, Chromosorb W (80-100 mesh), 50. C @ 0. min, 5. K/min, 250. C @ 0. min; Column length: 1.8 m |

Normal alkane RI, non-polar column, custom temperature program

Column type | Active phase | I | Reference | Comment |
---|---|---|---|---|
Capillary | RSL-150 | 1039. | Buchbauer, Nikiforov, et al., 1994 | 60. m/0.32 mm/0.25 μm, He; Program: 30c (1.5min) => 20C/min => 55C => 6C/min => 200C(10min) |

References

Frinton Laboratories Inc., 1986
Frinton Laboratories Inc.,
Catalog Number 11, Frinton Laboratories Inc., Vineland, NJ, 1986, 99. [all data]
Steele, Chirico, et al., 2002
Steele, W.V.; Chirico, R.D.; Knipmeyer, S.E.; Nguyen, A.,
Measurements of Vapor Pressure, Heat Capacity, and Density along the Saturation Line for Cyclopropane Carboxylic Acid, N , N -Diethylethanolamine, 2,3-Dihydrofuran, 5-Hexen-2-one, Perfluorobutanoic Acid, and 2-Phenylpropionaldehyde,
J. Chem. Eng. Data, 2002, 47, 4, 715-724, https://doi.org/10.1021/je010087j
. [all data]