1,4-Benzenediamine, N,N-diethyl-

Phase change data

Data compiled by: Robert L. Brown and Stephen E. Stein

Quantity Value Units Method Reference Comment
Tboil534.2KN/AWeast and Grasselli, 1989

Reduced pressure boiling point

Tboil (K) Pressure (bar) Reference
388.70.007Aldrich Chemical Company Inc., 1990

Van Den Dool and Kratz RI, non-polar column, temperature ramp

Data compiled by: NIST Mass Spectrometry Data Center, William E. Wallace, director

Column type Capillary
Active phase OV-1
Column length (m)
Carrier gas
Substrate
Column diameter (mm)
Phase thickness (μm)
Tstart (C) 35.
Tend (C) 300.
Heat rate (K/min) 8.
Initial hold (min)
Final hold (min)
I 1429.6
ReferenceGautzsch and Zinn, 1996
Comment MSDC-RI

References

Weast and Grasselli, 1989
CRC Handbook of Data on Organic Compounds, 2nd Editon, Weast,R.C and Grasselli, J.G., ed(s)., CRC Press, Inc., Boca Raton, FL, 1989, 1. [all data]

Aldrich Chemical Company Inc., 1990
Aldrich Chemical Company Inc., Catalog Handbook of Fine Chemicals, Aldrich Chemical Company, Inc., Milwaukee WI, 1990, 1. [all data]