1-Pentene, 5-chloro-

Phase change data

Data compiled by: Thermodynamics Research Center, NIST Boulder Laboratories, Chris Muzny director

Quantity Value Units Method Reference Comment
Tboil378.KN/ABullock and Hand, 1950Uncertainty assigned by TRC = 4. K

In addition to the Thermodynamics Research Center (TRC) data available from this site, much more physical and chemical property data is available from the following TRC products:

References

Bullock and Hand, 1950
Bullock, M.W.; Hand, J.J., , 1950. [all data]