4,4'-Dihexanoyloxydiphenyldiacetylene

Phase change data

Data compiled by: Eugene S. Domalski and Elizabeth D. Hearing

Enthalpy of phase transition

ΔHtrs (kcal/mol) Temperature (K) Initial Phase Final Phase Reference Comment
4.5411343.crystaline, IIIcrystaline, IIOzcayir, Asrar, et al., 1984
0.3489396.crystaline, IIcrystaline, IOzcayir, Asrar, et al., 1984
6.2859407.crystaline, IliquidOzcayir, Asrar, et al., 1984
0.4087430.liquidliquidOzcayir, Asrar, et al., 1984

Entropy of phase transition

ΔStrs (cal/mol*K) Temperature (K) Initial Phase Final Phase Reference Comment
13.24343.crystaline, IIIcrystaline, IIOzcayir, Asrar, et al., 1984
0.8800396.crystaline, IIcrystaline, IOzcayir, Asrar, et al., 1984
15.45407.crystaline, I, Solidliquid, nematicOzcayir, Asrar, et al., 1984
0.9500430.liquid, Nematicliquid, isotropicOzcayir, Asrar, et al., 1984

References

Ozcayir, Asrar, et al., 1984
Ozcayir, Y.; Asrar, J.; Blumstein, A., Diacetylenic liquid crystals: a systematic investigation of the homologous series of 4,4'-dialkanoyloxydiphenyldiacetylenes, Mol. Cryst. Liq. Cryst., 1984, 110, 263-276. [all data]