quinoline, 5-acetamido-8-bromo-6-ethyl-
- Formula: C13H13BrN2O
- Molecular weight: 293.159
- IUPAC Standard InChIKey: QULUYGOFFPBECS-UHFFFAOYSA-N
- CAS Registry Number: 91761-87-4
- Chemical structure:
View 3d structure (requires JavaScript / HTML 5) - Permanent link for this species. Use this link for bookmarking this species for future reference.

Phase change data

Data compiled by: Thermodynamics Research Center, NIST Boulder Laboratories, Chris Muzny director
Quantity | Value | Units | Method | Reference | Comment |
---|---|---|---|---|---|
Tfus | 479.65 | K | N/A | Altau, Beasley, et al., 1963 | Uncertainty assigned by TRC = 2. K |

References

Altau, Beasley, et al., 1963
Altau, K.; Beasley, J.G.; Capps, J.D.,
8-Bromo-6-Ethylquinoline and Some Derivatives,
J. Chem. Eng. Data, 1963, 8, 130. [all data]