Benzene, 1-chloro-2-ethyl-

Phase change data

Data compiled as indicated in comments:
BS - Robert L. Brown and Stephen E. Stein
TRC - Thermodynamics Research Center, NIST Boulder Laboratories, Chris Muzny director
AC - William E. Acree, Jr., James S. Chickos

Quantity Value Units Method Reference Comment
Tboil451.6KN/AWeast and Grasselli, 1989BS
Tboil451.65KN/ALevi and Nicholls, 1958Uncertainty assigned by TRC = 1.5 K; TRC
Tboil451.58KN/ADreisbach and Martin, 1949Uncertainty assigned by TRC = 0.07 K; TRC
Quantity Value Units Method Reference Comment
Tfus189.83KN/ADreisbach and Martin, 1949Uncertainty assigned by TRC = 0.05 K; TRC

Enthalpy of vaporization

ΔvapH (kJ/mol) Temperature (K) Method Reference Comment
46.1368.AStephenson and Malanowski, 1987Based on data from 353. - 503. K. See also Dykyj and Vanko, 1970.; AC
47.2305.N/AStull, 1947Based on data from 290. - 450. K.; AC

Antoine Equation Parameters

log10(P) = A − (B / (T + C))
    P = vapor pressure (bar)
    T = temperature (K)

View plot Requires a JavaScript / HTML 5 canvas capable browser.

Temperature (K) A B C Reference Comment
290.4 - 450.84.418381787.315-45.259Stull, 1947Coefficents calculated by NIST from author's data.

In addition to the Thermodynamics Research Center (TRC) data available from this site, much more physical and chemical property data is available from the following TRC products:

Condensed phase thermochemistry data

Data compiled by: Hussein Y. Afeefy, Joel F. Liebman, and Stephen E. Stein

Quantity Value Units Method Reference Comment
Δfliquid-48.5 ± 1.6kJ/molEqkKovzel, Nesterova, et al., 1982
Δfliquid-54. ± 1.kJ/molCcbHubbard, Knowlton, et al., 1954
Quantity Value Units Method Reference Comment
Δcliquid-4403.2 ± 1.3kJ/molCcbHubbard, Knowlton, et al., 1954

Reaction thermochemistry data

Data compiled by: Hussein Y. Afeefy, Joel F. Liebman, and Stephen E. Stein

Individual Reactions

Benzene, 1-chloro-2-ethyl- = Benzene, 1-chloro-4-ethyl-

By formula: C8H9Cl = C8H9Cl

Quantity Value Units Method Reference Comment
Δr-0.31 ± 0.32kcal/molEqkKovzel, Nesterova, et al., 1982liquid phase

Kovats' RI, non-polar column, isothermal

View large format table.

Column type Active phase Temperature (C) I Reference Comment
PackedE-301140.1038.Skobeleva and Shevchenko, 1976
PackedE-301160.1050.Skobeleva and Shevchenko, 1976

Kovats' RI, polar column, isothermal

View large format table.

Column type Active phase Temperature (C) I Reference Comment
PackedCarbowax 20M200.1429.Vernon and Suratman, 1983He, Silanized white support; Column length: 2. m
PackedPEG-20M150.1439.Skobeleva and Shevchenko, 1976Chromaton N AW DMCS; Column length: 4. m
PackedPEG-20M170.1470.Skobeleva and Shevchenko, 1976Chromaton N AW DMCS; Column length: 4. m

Van Den Dool and Kratz RI, non-polar column, temperature ramp

View large format table.

Column type Active phase I Reference Comment
CapillaryOV-11019.5Gautzsch and Zinn, 19968. K/min; Tstart: 35. C; Tend: 300. C

Normal alkane RI, non-polar column, custom temperature program

View large format table.

Column type Active phase I Reference Comment
CapillaryPolydimethyl siloxanes1016.Zenkevich and Chupalov, 1996Program: not specified

References

Weast and Grasselli, 1989
CRC Handbook of Data on Organic Compounds, 2nd Editon, Weast,R.C and Grasselli, J.G., ed(s)., CRC Press, Inc., Boca Raton, FL, 1989, 1. [all data]

Levi and Nicholls, 1958
Levi, L.; Nicholls, R.V.V., Formation of Styrene by Pyrolysis of Aromatic Heterocyclic Aldehyde- Aliphatic Acid Anhydride Mixtures on Morden Bentonite, Ind. Eng. Chem., 1958, 50, 1005. [all data]

Dreisbach and Martin, 1949
Dreisbach, R.R.; Martin, R.A., Physical Data on Some Organic Compounds, Ind. Eng. Chem., 1949, 41, 2875-8. [all data]

Stephenson and Malanowski, 1987
Stephenson, Richard M.; Malanowski, Stanislaw, Handbook of the Thermodynamics of Organic Compounds, 1987, https://doi.org/10.1007/978-94-009-3173-2 . [all data]

Dykyj and Vanko, 1970
Dykyj, J.; Vanko, A., Petrochemica, 1970, 10, 1, 3. [all data]

Stull, 1947
Stull, Daniel R., Vapor Pressure of Pure Substances. Organic and Inorganic Compounds, Ind. Eng. Chem., 1947, 39, 4, 517-540, https://doi.org/10.1021/ie50448a022 . [all data]