Ciprofloxacin

Phase change data

Data compiled by: William E. Acree, Jr., James S. Chickos

Enthalpy of fusion

ΔfusH (kJ/mol) Temperature (K) Method Reference
64.48541.5DSCYu, Zipp, et al., 1994

References

Yu, Zipp, et al., 1994
Yu, Xuanqiang; Zipp, Gail L.; Davidson III, G.W. Ray, Pharmaceutical Research, 1994, 11, 4, 522-527, https://doi.org/10.1023/A:1018910431216 . [all data]