Ethyl(1,1-dimethylpropyl)malononitrile

Phase change data

Data compiled as indicated in comments:
ALS - Hussein Y. Afeefy, Joel F. Liebman, and Stephen E. Stein
DRB - Donald R. Burgess, Jr.
AC - William E. Acree, Jr., James S. Chickos

Quantity Value Units Method Reference Comment
Δsub76.23 ± 0.75kJ/molVBeckhaus, Dogan, et al., 1990ALS
Δsub76.3kJ/molN/ABeckhaus, Dogan, et al., 1990DRB
Δsub76.2 ± 0.8kJ/molN/ABeckhaus, Dogan, et al., 1990AC

Enthalpy of fusion

ΔfusH (kJ/mol) Temperature (K) Reference Comment
19.25307.5Beckhaus, Dogan, et al., 1990AC

Condensed phase thermochemistry data

Data compiled by: Hussein Y. Afeefy, Joel F. Liebman, and Stephen E. Stein

Quantity Value Units Method Reference Comment
Δfsolid-15.0 ± 1.7kJ/molCcbBeckhaus, Dogan, et al., 1990
Quantity Value Units Method Reference Comment
Δcsolid-6206.8 ± 1.7kJ/molCcbBeckhaus, Dogan, et al., 1990

References

Beckhaus, Dogan, et al., 1990
Beckhaus, H.D.; Dogan, B.; Pakusch, J.; Verevkin, S.; Ruechardt, C., Geminal substituent effects. 4. The dependence of the inverse anomeric effect of geminal cyano groups on the structure, Chem. Ber., 1990, 123, 2153-2159. [all data]