Naphthalene, 1,4-dibromo-

Phase change data

Data compiled by: William E. Acree, Jr., James S. Chickos

Enthalpy of sublimation

ΔsubH (kJ/mol) Temperature (K) Method Reference
90.8 ± 1.7297. - 322.MEGoldfarb and Suuberg, 2008

References

Goldfarb and Suuberg, 2008
Goldfarb, Jillian L.; Suuberg, Eric M., The effect of halogen hetero-atoms on the vapor pressures and thermodynamics of polycyclic aromatic compounds measured via the Knudsen effusion technique, The Journal of Chemical Thermodynamics, 2008, 40, 3, 460-466, https://doi.org/10.1016/j.jct.2007.09.006 . [all data]