1,1,3,3-Tetraphenyl-1,3-dimethyldisiloxane

Phase change data

Data compiled as indicated in comments:
AC - William E. Acree, Jr., James S. Chickos
DH - Eugene S. Domalski and Elizabeth D. Hearing

Enthalpy of vaporization

ΔvapH (kJ/mol) Temperature (K) Method Reference Comment
93.3533.AStephenson and Malanowski, 1987Based on data from 518. - 616. K.; AC
64.4602.N/ADitsent, Skorokhodov, et al., 1974Based on data from 518. - 685. K.; AC

Enthalpy of fusion

ΔfusH (kJ/mol) Temperature (K) Reference Comment
26.577321.95Dzhafarov and Kuliev, 1986DH
26.58322.Domalski and Hearing, 1996AC

Condensed phase thermochemistry data

Data compiled by: Eugene S. Domalski and Elizabeth D. Hearing

Quantity Value Units Method Reference Comment
solid,1 bar136.3cal/mol*KN/ADzhafarov and Kuliev, 1986

Constant pressure heat capacity of solid

Cp,solid (cal/mol*K) Temperature (K) Reference Comment
120.3298.15Dzhafarov and Kuliev, 1986T = 4 to 300 K. Cp(c) = 125.6 + 0.394T + 3.94x10-3T2 (80 to 150 K); Cp(c) = 133.78 + 0.6826T + 2.0758x10-3T2 (170 to 290 K).

References

Stephenson and Malanowski, 1987
Stephenson, Richard M.; Malanowski, Stanislaw, Handbook of the Thermodynamics of Organic Compounds, 1987, https://doi.org/10.1007/978-94-009-3173-2 . [all data]

Ditsent, Skorokhodov, et al., 1974
Ditsent, V.E.; Skorokhodov, I.I.; Terent'eva, N.A.; Zolotareva, M.N., Russ. J. Phys. Chem., 1974, 48, 447. [all data]

Dzhafarov and Kuliev, 1986
Dzhafarov, O.I.; Kuliev, A.M., Heat capacity and thermodynamic properties of disiloxanes, Dokl. Akad. Nauk. Azerb., 1986, SSR 42, 56-59. [all data]

Domalski and Hearing, 1996
Domalski, Eugene S.; Hearing, Elizabeth D., Heat Capacities and Entropies of Organic Compounds in the Condensed Phase. Volume III, J. Phys. Chem. Ref. Data, 1996, 25, 1, 1, https://doi.org/10.1063/1.555985 . [all data]