Phenol, 4-(1,1-dimethylpropyl)-

Reaction thermochemistry data

Data compiled by: Hussein Y. Afeefy, Joel F. Liebman, and Stephen E. Stein

Individual Reactions

2-(1,1-dimethylpropyl)phenol = Phenol, 4-(1,1-dimethylpropyl)-

By formula: C11H16O = C11H16O

Quantity Value Units Method Reference Comment
Δr-16.7 ± 1.8kJ/molEqkNesterova, Verevkin, et al., 1985liquid phase

Van Den Dool and Kratz RI, non-polar column, custom temperature program

Data compiled by: NIST Mass Spectrometry Data Center, William E. Wallace, director

Column type CapillaryCapillaryCapillary
Active phase VF-5MSVF-5MSVF-5MS
Column length (m) 50.50.50.
Carrier gas HeHeHe
Substrate
Column diameter (mm) 0.250.250.25
Phase thickness (μm) 0.250.250.25
Program 60C(2min) => 30C/min => 100C => 1C/min => 60C(2min) => 30C/min => 100C => 2C/min => 60C(2min) => 30C/min => 100C => 4C/min =>
I 1397.21400.11404.4
ReferenceMjøs, Meier, et al., 2006Mjøs, Meier, et al., 2006Mjøs, Meier, et al., 2006
Comment MSDC-RI MSDC-RI MSDC-RI

References

Nesterova, Verevkin, et al., 1985
Nesterova, T.N.; Verevkin, S.P.; Malova, T.N.; Pilshchikov, V.A., Study of an equilibrium of tert-alkylphenols (thermodynamic analysis of the alkylation of phenols by branched olefins), Zh. Prikl. Khim. (Leningrad), 1985, 58, 827-833. [all data]