Bis(2,6-dimethylphenyldiazene)-1,2-dioxide

Reaction thermochemistry data

Data compiled by: Hussein Y. Afeefy, Joel F. Liebman, and Stephen E. Stein

Individual Reactions

Bis(2,6-dimethylphenyldiazene)-1,2-dioxide = 2Benzene, 1,3-dimethyl-2-nitroso-

By formula: C16H18N2O2 = 2C8H9NO

Quantity Value Units Method Reference Comment
Δr94.2kJ/molEqkOrrell, Stephenson, et al., 1990liquid phase; solvent: CDCl3; NMR
Δr94.2kJ/molEqkOrrell, Stephenson, et al., 1989liquid phase; solvent: CDCl3; NMR

References

Orrell, Stephenson, et al., 1990
Orrell, K.G.; Stephenson, D.; Verlaque, J.H., Monomer-dimer solution equilibria of 2,4,6-trialkylnitrosobenzenes and 2,4,6-trialkylnitrosobenzene/nitrosobenzene mixtures. A study using one- and two-dimensional NMR techniques, J. Chem. Soc. Perkin Trans. 2, 1990, 1297-1303. [all data]

Orrell, Stephenson, et al., 1989
Orrell, K.G.; Stephenson, D.; Rault, T., NMR study of the monomer-dimer equilibria of dimethylnitrosobenzenes in solution. Identification of mixed azodioxy dimeric species, Magn. Reson. Chem., 1989, 27, 368-376. [all data]