4-Aza-3-heptene

Reaction thermochemistry data

Data compiled by: Hussein Y. Afeefy, Joel F. Liebman, and Stephen E. Stein

Individual Reactions

Hydrogen + C6H13N = 1-Propanamine, N-propyl-

By formula: H2 + C6H13N = C6H15N

Quantity Value Units Method Reference Comment
Δr80.8 ± 0.8kJ/molChydJackman and Packham, 1957liquid phase; solvent: bis-2-Ethoxyethyl ether

References

Jackman and Packham, 1957
Jackman, L.M.; Packham, D.I., The experimental resonance energy of acridine, Proc. Chem. Soc., London, 1957, 349-350. [all data]