Methylphenylsilane

Gas phase ion energetics data

Data compiled by: John E. Bartmess

De-protonation reactions

C7H9Si- + Hydrogen cation = Methylphenylsilane

By formula: C7H9Si- + H+ = C7H10Si

Quantity Value Units Method Reference Comment
Δr1559. ± 8.8kJ/molG+TSWetzel, Salomon, et al., 1989gas phase; value altered from reference due to change in acidity scale
Quantity Value Units Method Reference Comment
Δr1527. ± 8.4kJ/molIMREWetzel, Salomon, et al., 1989gas phase; value altered from reference due to change in acidity scale

Reaction thermochemistry data

Data compiled by: John E. Bartmess

Individual Reactions

C7H9Si- + Hydrogen cation = Methylphenylsilane

By formula: C7H9Si- + H+ = C7H10Si

Quantity Value Units Method Reference Comment
Δr1559. ± 8.8kJ/molG+TSWetzel, Salomon, et al., 1989gas phase; value altered from reference due to change in acidity scale
Quantity Value Units Method Reference Comment
Δr1527. ± 8.4kJ/molIMREWetzel, Salomon, et al., 1989gas phase; value altered from reference due to change in acidity scale

References

Wetzel, Salomon, et al., 1989
Wetzel, D.M.; Salomon, K.E.; Berger, S.; Brauman, J.I., Gas-Phase Acidities of Organosilanes and Electron Affinities of Organosilyl Radicals, J. Am. Chem. Soc., 1989, 111, 11, 3835, https://doi.org/10.1021/ja00193a013 . [all data]