3-Penten-1-ol, (E)-

Phase change data

Data compiled by: Thermodynamics Research Center, NIST Boulder Laboratories, Chris Muzny director

Quantity Value Units Method Reference Comment
Tboil410.KN/ACrombie and Harper, 1950Uncertainty assigned by TRC = 3. K

In addition to the Thermodynamics Research Center (TRC) data available from this site, much more physical and chemical property data is available from the following TRC products:

References

Crombie and Harper, 1950
Crombie, L.; Harper, S.H., "Leaf Alcohol" and the Stereochemistry of the cis- and trans-3-hexen-1-ols and -3-Penten-1-ols, J. Chem. Soc., 1950, 1950, 877-82. [all data]