Benzaldehyde, 2-chloro-4-hydroxy-3,5-dimethoxy-

Phase change data

Data compiled by: William E. Acree, Jr., James S. Chickos

Enthalpy of vaporization

ΔvapH (kJ/mol) Temperature (K) Method Reference Comment
77.7308.CGCLei, Wania, et al., 1999Based on data from 293. - 323. K.

Enthalpy of fusion

ΔfusH (kJ/mol) Temperature (K) Method Reference
25.94395.4DSCPlato and Glasgow, 1969

References

Lei, Wania, et al., 1999
Lei, Ying Duan; Wania, Frank; Shiu, Wan Ying; Boocock, David G.B., Temperature Dependent Vapor Pressures of Chlorinated Catechols, Syringols, and Syringaldehydes, J. Chem. Eng. Data, 1999, 44, 2, 200-202, https://doi.org/10.1021/je9801819 . [all data]

Plato and Glasgow, 1969
Plato, Candace.; Glasgow, Augustus R., Differential scanning calorimetry as a general method for determining the purity and heat of fusion of high-purity organic chemicals. Application to 95 compounds, Anal. Chem., 1969, 41, 2, 330-336, https://doi.org/10.1021/ac60271a041 . [all data]