4-Propionyl-4'-n-tridecanoyloxyazobenzene
- Formula: C28H38N2O3
- Molecular weight: 450.6129
- IUPAC Standard InChIKey: FFEMJSHTGJQOPX-QVIHXGFCSA-N
- CAS Registry Number: 76204-59-6
- Chemical structure:
View 3d structure (requires JavaScript / HTML 5) - Permanent link for this species. Use this link for bookmarking this species for future reference.

Phase change data

Data compiled by: Eugene S. Domalski and Elizabeth D. Hearing
Enthalpy of fusion
ΔfusH (kJ/mol) | Temperature (K) | Reference | Comment |
---|---|---|---|
44.769 | 374.65 | Fanelli, Poeti, et al., 1983 | Solid-smectic A. |
Entropy of fusion
ΔfusS (J/mol*K) | Temperature (K) | Reference | Comment |
---|---|---|---|
119.5 | 374.65 | Fanelli, Poeti, et al., 1983 | Solid-smectic |
Enthalpy of phase transition
ΔHtrs (kJ/mol) | Temperature (K) | Initial Phase | Final Phase | Reference | Comment |
---|---|---|---|---|---|
8.075 | 416.65 | liquid | liquid | Fanelli, Poeti, et al., 1983 |
Entropy of phase transition
ΔStrs (J/mol*K) | Temperature (K) | Initial Phase | Final Phase | Reference | Comment |
---|---|---|---|---|---|
19.4 | 416.65 | liquid, Smectic A | liquid, isotropic | Fanelli, Poeti, et al., 1983 |

References

Fanelli, Poeti, et al., 1983
Fanelli, E.; Poeti, G.; Braghetti, M.,
Calorimetric study of 4-propionyl-4'-n-alkanoyloxyazobenzene series,
Mol. Cryst. Liq. Cryst., 1983, 92, 127-134. [all data]