Cyclohexane, 1-(1,1-dimethylethyl)-4-methyl-

Phase change data

Data compiled by: Thermodynamics Research Center, NIST Boulder Laboratories, Chris Muzny director

Quantity Value Units Method Reference Comment
Tboil459.87KN/ASerijan, Wise, et al., 1949Uncertainty assigned by TRC = 1. K
Tboil461.89KN/ASerijan, Wise, et al., 1949Uncertainty assigned by TRC = 1. K

In addition to the Thermodynamics Research Center (TRC) data available from this site, much more physical and chemical property data is available from the following TRC products:

References

Serijan, Wise, et al., 1949
Serijan, K.T.; Wise, P.H.; Gibbons, L.C., The physical properties of five isomeric methyl-t-butylcyclohexanes, J. Am. Chem. Soc., 1949, 71, 2265-6. [all data]