5-Nitro-2-acetoxy-2,5-dihydrofurfural diacetate

Condensed phase thermochemistry data

Data compiled by: Hussein Y. Afeefy, Joel F. Liebman, and Stephen E. Stein

Quantity Value Units Method Reference Comment
Δfsolid-1374. ± 2.kJ/molCcbBalepin, Lebedev, et al., 1980
Quantity Value Units Method Reference Comment
Δcsolid-4812. ± 2.kJ/molCcbBalepin, Lebedev, et al., 1980

Phase change data

Data compiled by: Hussein Y. Afeefy, Joel F. Liebman, and Stephen E. Stein

Quantity Value Units Method Reference Comment
Δsub89. ± 2.kJ/molVBalepin, Lebedev, et al., 1980

References

Balepin, Lebedev, et al., 1980
Balepin, A.A.; Lebedev, V.P.; Kuznetsova, A.A.; Venter, K.K.; Trushule, M.A.; Lolya, D.O.; Lebedev, Yu.A., Thermochemical properties of α-nitro derivatives of furan, Bull. Acad. Sci. USSR, Div. Chem. Sci., 1980, 601-604. [all data]