Nitrobenzene, 4-(2-cyano-2-phenylethenyl)

Condensed phase thermochemistry data

Data compiled by: Hussein Y. Afeefy, Joel F. Liebman, and Stephen E. Stein

Quantity Value Units Method Reference Comment
Δfsolid155.kJ/molCcbZavoianu, Contineanu, et al., 1986
Quantity Value Units Method Reference Comment
Δcsolid-7490.kJ/molCcbZavoianu, Contineanu, et al., 1986

References

Zavoianu, Contineanu, et al., 1986
Zavoianu, D.; Contineanu, I.; Moga-Gheorghe, S.; Marchidan, D., Structure and reactivity of nitriles. Condensation reaction of phenylacetonitrile with benzaldehydes, Rev. Chim. (Bucharest), 1986, 37, 1055-1058. [all data]