2-Chloroethyl butanoate

Condensed phase thermochemistry data

Data compiled by: Hussein Y. Afeefy, Joel F. Liebman, and Stephen E. Stein

Quantity Value Units Method Reference Comment
Δcliquid-3338.kJ/molCcbSchjanberg, 1935

References

Schjanberg, 1935
Schjanberg, E., Die Verbrennungswarmen und die Refraktionsdaten einiger chlorsubstituierter Fettsauren und Ester., Z. Phys. Chem. Abt. A, 1935, 172, 197-233. [all data]