2H-Thiete-1,1-dioxide

Condensed phase thermochemistry data

Data compiled by: Hussein Y. Afeefy, Joel F. Liebman, and Stephen E. Stein

Quantity Value Units Method Reference Comment
Δfsolid-207.9 ± 0.84kJ/molCcrMackle, McNally, et al., 1969Heat of combustion corrected for pressure
Quantity Value Units Method Reference Comment
Δcsolid-2146.3 ± 0.42kJ/molCcrMackle, McNally, et al., 1969Heat of combustion corrected for pressure

References

Mackle, McNally, et al., 1969
Mackle, H.; McNally, D.V.; Steele, W.V., Studies in the thermochemistry of sulphones. Part 10. Heats of combustion and formation of several αβ-unsaturated sulphones, Trans. Faraday Soc., 1969, 65, 2060-2068. [all data]