octan-2-one oxime

Condensed phase thermochemistry data

Data compiled by: Hussein Y. Afeefy, Joel F. Liebman, and Stephen E. Stein

Quantity Value Units Method Reference Comment
Δcliquid-5341.0 ± 2.2kJ/molCcbGeiseler, Ratzsch, et al., 1966

References

Geiseler, Ratzsch, et al., 1966
Geiseler, G.; Ratzsch, M.; Ebster, K.; Ziegel, E., Bildungsenthalpien stellungsisomerer Alkanderivate 2. Mitteilung: Bildungsenthalpien des Octanaloxims und der drei isomeren Octanonoxime, Ber. Bunsen-Ges. Phys. Chem., 1966, 70, 221-228. [all data]