N,N'-Bis-(p-methoxyphenyl)terephthalamide

Phase change data

Data compiled by: Hussein Y. Afeefy, Joel F. Liebman, and Stephen E. Stein

Quantity Value Units Method Reference Comment
Δsub228. ± 8.4kJ/molEHamilton, Mitchell, et al., 1973

References

Hamilton, Mitchell, et al., 1973
Hamilton, W.S.; Mitchell, G.M.; Ayers, D.A., Heat of combustion of N,N'-bis(m-methoxyphenyl)terephthalamide and NN'-bis(p-methoxyphenyl)terephthalamide, J. Chem. Eng. Data, 1973, 18, 364-366. [all data]