Ethanamine, N-ethyl-N-nitro-

Condensed phase thermochemistry data

Data compiled by: Hussein Y. Afeefy, Joel F. Liebman, and Stephen E. Stein

Quantity Value Units Method Reference Comment
Δfliquid-106. ± 8.4kJ/molCcbCass, Fletcher, et al., 1958
Quantity Value Units Method Reference Comment
Δcliquid-2897. ± 8.4kJ/molCcbCass, Fletcher, et al., 1958
Δcliquid-2896.kJ/molCcbHandrick, 1956Naval Powder Factory Report 88, 1954

References

Cass, Fletcher, et al., 1958
Cass, R.C.; Fletcher, S.E.; Mortimer, C.T.; Quincey, P.G.; Springall, H.D., Heats of combustion and molecular structure. Part IV. Aliphatic nitroalkanes and nitric esters, J. Chem. Soc., 1958, 958-962. [all data]

Handrick, 1956
Handrick, G.R., Report of the study of pure explosive compounds. Part IV. Calculation of heat of combustion of organic compounds from structural features and calculation of power of high explosives, Rpt. C-58247 for the Office of the Chief of Ordnance, contract DA-19-020-ORD-47 by the Arthur D. Little, Inc., Cambridge, MA, 1956, 467-573. [all data]