p-Trifluoromethylpropiophenone
- Formula: C10H9F3O
- Molecular weight: 202.1731
- IUPAC Standard InChIKey: QFKOWENRSZZLPK-UHFFFAOYSA-N
- CAS Registry Number: 711-33-1
- Chemical structure:
View 3d structure (requires JavaScript / HTML 5) - Permanent link for this species. Use this link for bookmarking this species for future reference.

Phase change data

Data compiled by: Robert L. Brown and Stephen E. Stein
Reduced pressure boiling point
Tboil (K) | Pressure (bar) | Reference |
---|---|---|
356. to 357. | 0.0008 | PCR Inc., 1990 |

References

PCR Inc., 1990
PCR Inc.,
Research Chemicals Catalog 1990-1991, PCR Inc., Gainesville, FL, 1990, 1. [all data]