1-(but-2-enyl)piperidine

Condensed phase thermochemistry data

Data compiled by: Hussein Y. Afeefy, Joel F. Liebman, and Stephen E. Stein

Quantity Value Units Method Reference Comment
Δfliquid-55.06kJ/molCcbProchazka, Krestanova, et al., 1970
Quantity Value Units Method Reference Comment
Δcliquid-5916.1 ± 3.6kJ/molCcbProchazka, Krestanova, et al., 1970

References

Prochazka, Krestanova, et al., 1970
Prochazka, M.; Krestanova, V.; Palecek, M.; Pecka, K., The heats of formation of some enamines, Collect. Czech. Chem. Commun., 1970, 35, 3813-3817. [all data]