2-Furancarboxaldehyde, 5-nitro-

Phase change data

Data compiled as indicated in comments:
BS - Robert L. Brown and Stephen E. Stein
TRC - Thermodynamics Research Center, NIST Boulder Laboratories, Chris Muzny director
ALS - Hussein Y. Afeefy, Joel F. Liebman, and Stephen E. Stein

Quantity Value Units Method Reference Comment
Tfus309.KN/AGilman and Wright, 1931Uncertainty assigned by TRC = 5. K; TRC

Reduced pressure boiling point

Tboil (K) Pressure (bar) Reference Comment
403.20.013Weast and Grasselli, 1989BS

Enthalpy of sublimation

ΔsubH (kJ/mol) Temperature (K) Method Reference Comment
79. ± 3.283.VBalepin, Lebedev, et al., 1980see Balepin, Lebedev, et al., 1978; ALS

In addition to the Thermodynamics Research Center (TRC) data available from this site, much more physical and chemical property data is available from the following TRC products:

References

Gilman and Wright, 1931
Gilman, H.; Wright, G.F., Nitrofurfuryl Alcohol, J. Am. Chem. Soc., 1931, 53, 1923-4. [all data]

Weast and Grasselli, 1989
CRC Handbook of Data on Organic Compounds, 2nd Editon, Weast,R.C and Grasselli, J.G., ed(s)., CRC Press, Inc., Boca Raton, FL, 1989, 1. [all data]

Balepin, Lebedev, et al., 1980
Balepin, A.A.; Lebedev, V.P.; Kuznetsova, A.A.; Venter, K.K.; Trushule, M.A.; Lolya, D.O.; Lebedev, Yu.A., Thermochemical properties of α-nitro derivatives of furan, Bull. Acad. Sci. USSR, Div. Chem. Sci., 1980, 601-604. [all data]

Balepin, Lebedev, et al., 1978
Balepin, A.A.; Lebedev, V.P.; Kuznetsova, A.A.; Venters, K.; Trusule, M.; Ignatovich, L.M.; Lebedev, Yu.A., Aromatic stabilizatio of furan derivatives, Vses. Nauchn. Konf. Khim. Tekhnol. Furanovykh Soedin., [Tezisy Dokl.], 1978, 3, 57-58. [all data]