Benzenamine, 2-bromo-N,N-dimethyl-
- Formula: C8H10BrN
- Molecular weight: 200.076
- IUPAC Standard InChIKey: ONMSBNJJCUCYED-UHFFFAOYSA-N
- CAS Registry Number: 698-00-0
- Chemical structure:
View 3d structure (requires JavaScript / HTML 5) - Other names: 2-bromo-N,N-dimethylaniline

Phase change data

Data compiled by: Robert L. Brown and Stephen E. Stein
Reduced pressure boiling point
Tboil (K) | Pressure (bar) | Reference |
---|---|---|
380.7 | 0.019 | Weast and Grasselli, 1989 |
380. to 381. | 0.019 | Buckingham and Donaghy, 1982 |

References

Weast and Grasselli, 1989
CRC Handbook of Data on Organic Compounds, 2nd Editon, Weast,R.C and Grasselli, J.G., ed(s)., CRC Press, Inc., Boca Raton, FL, 1989, 1. [all data]
Buckingham and Donaghy, 1982
Buckingham, J.; Donaghy, S.M.,
Dictionary of Organic Compounds: Fifth Edition, Chapman and Hall, New York, 1982, 1. [all data]