Furan, tetrahydro-2,5-dimethoxy-
- Formula: C6H12O3
- Molecular weight: 132.1577
- IUPAC Standard InChIKey: GFISDBXSWQMOND-UHFFFAOYSA-N
- CAS Registry Number: 696-59-3
- Chemical structure:
View 3d structure (requires JavaScript / HTML 5) - Other names: Dimethoxytetrahydrofuran; Tetrahydro-2,5-dimethoxyfuran; 2,5-Dimethoxytetrahydrofuran; 2,5-Dimethoxytetrahydrofuran,c&t; cis,trans-2,5-Dimethoxytetrahydrofuran; Protectol DMT

Reaction thermochemistry data

Data compiled by: Hussein Y. Afeefy, Joel F. Liebman, and Stephen E. Stein
Individual Reactions
By formula: H2 + C6H10O3 = C6H12O3
Quantity | Value | Units | Method | Reference | Comment |
---|---|---|---|---|---|
ΔrH° | -131.1 ± 0.59 | kJ/mol | Chyd | Allinger, Glaser, et al., 1981 | liquid phase; solvent: Hexane |

Phase change data

Data compiled by: Robert L. Brown and Stephen E. Stein
Quantity | Value | Units | Method | Reference | Comment |
---|---|---|---|---|---|
Tboil | 418.9 | K | N/A | Weast and Grasselli, 1989 |

References

Allinger, Glaser, et al., 1981
Allinger, N.L.; Glaser, J.A.; Davis, H.E.,
Heats of hydrogenation of some vinyl ethers and related compounds,
J. Org. Chem., 1981, 46, 658-661. [all data]