Butanamide, 3-methyl-N-(2-methylpropylidene)

Phase change data

Data compiled as indicated in comments:
ALS - Hussein Y. Afeefy, Joel F. Liebman, and Stephen E. Stein
DRB - Donald R. Burgess, Jr.

Quantity Value Units Method Reference Comment
Δvap42. ± 2.kJ/molVBedford, Edmondson, et al., 1962ALS
Δvap41.8kJ/molN/ABedford, Edmondson, et al., 1962DRB

Enthalpy of vaporization

ΔvapH (kJ/mol) Temperature (K) Method Reference Comment
42. ± 2.293.VCoates and Sutton, 1948ALS

Gas phase thermochemistry data

Data compiled by: Hussein Y. Afeefy, Joel F. Liebman, and Stephen E. Stein

Quantity Value Units Method Reference Comment
Δfgas-91.2 ± 5.4kJ/molCcbBedford, Edmondson, et al., 1962

Condensed phase thermochemistry data

Data compiled by: Hussein Y. Afeefy, Joel F. Liebman, and Stephen E. Stein

Quantity Value Units Method Reference Comment
Δfliquid-31.8 ± 0.8kcal/molCcbBedford, Edmondson, et al., 1962
Quantity Value Units Method Reference Comment
Δcliquid-1301.35 ± 0.81kcal/molCcbBedford, Edmondson, et al., 1962
Δcliquid-1294.6 ± 2.5kcal/molCcbCoates and Sutton, 1948Reanalyzed by Cox and Pilcher, 1970, Original value = -1295. ± 2.4 kcal/mol

References

Bedford, Edmondson, et al., 1962
Bedford, A.F.; Edmondson, P.B.; Mortimer, C.T., Heats of formation and bond energies. Part VI. n-Butyliso-butyraldimine, n-butylisobutylamine, pyrazole, and imidazole, J. Chem. Soc., 1962, 2927-2931. [all data]

Coates and Sutton, 1948
Coates, G.E.; Sutton, L.E., The heats of formation of the -N=N- and >C=N- bonds, J. Chem. Soc., 1948, 1187-1196. [all data]