disodium metasilicate

Condensed phase thermochemistry data

Quantity Value Units Method Reference Comment
Δfliquid-1510.88kJ/molReviewChase, 1998Data last reviewed in September, 1967
Quantity Value Units Method Reference Comment
liquid,1 bar150.49J/mol*KReviewChase, 1998Data last reviewed in September, 1967
Quantity Value Units Method Reference Comment
Δfsolid-1561.43kJ/molReviewChase, 1998Data last reviewed in September, 1967
Quantity Value Units Method Reference Comment
solid113.71J/mol*KReviewChase, 1998Data last reviewed in September, 1967

Liquid Phase Heat Capacity (Shomate Equation)

Cp° = A + B*t + C*t2 + D*t3 + E/t2
H° − H°298.15= A*t + B*t2/2 + C*t3/3 + D*t4/4 − E/t + F − H
S° = A*ln(t) + B*t + C*t2/2 + D*t3/3 − E/(2*t2) + G
    Cp = heat capacity (J/mol*K)
    H° = standard enthalpy (kJ/mol)
    S° = standard entropy (J/mol*K)
    t = temperature (K) / 1000.

View plot Requires a JavaScript / HTML 5 canvas capable browser.

View table.

Temperature (K) 1362. - 2500.
A 177.3183
B 4.151997×10-10
C -5.330626×10-10
D 1.369917×10-10
E -2.593035×10-10
F -1583.552
G 323.5253
H -1510.876
ReferenceChase, 1998
Comment Data last reviewed in September, 1967

Solid Phase Heat Capacity (Shomate Equation)

Cp° = A + B*t + C*t2 + D*t3 + E/t2
H° − H°298.15= A*t + B*t2/2 + C*t3/3 + D*t4/4 − E/t + F − H
S° = A*ln(t) + B*t + C*t2/2 + D*t3/3 − E/(2*t2) + G
    Cp = heat capacity (J/mol*K)
    H° = standard enthalpy (kJ/mol)
    S° = standard entropy (J/mol*K)
    t = temperature (K) / 1000.

View plot Requires a JavaScript / HTML 5 canvas capable browser.

View table.

Temperature (K) 298. - 1362.
A 114.1822
B 76.97221
C -23.52128
D 3.741341
E -2.076642
F -1605.689
G 218.2676
H -1561.427
ReferenceChase, 1998
Comment Data last reviewed in September, 1967

References

Chase, 1998
Chase, M.W., Jr., NIST-JANAF Themochemical Tables, Fourth Edition, J. Phys. Chem. Ref. Data, Monograph 9, 1998, 1-1951. [all data]