1H-Imidazole, 2-phenyl-

Phase change data

Data compiled by: William E. Acree, Jr., James S. Chickos

Enthalpy of fusion

ΔfusH (kJ/mol) Temperature (K) Method Reference
17.81420.DSCSifaoui, Ait-Kaci, et al., 2007

References

Sifaoui, Ait-Kaci, et al., 2007
Sifaoui, Hocine; Ait-Kaci, Ahmed; Modarressi, Ali; Rogalski, Marek, Solid--liquid equilibria of three binary systems: {1-Ethyl-3-methylimidazolium hexafluorophosphate+2-phenylimidazole, or 4,5-diphenylimidazole or 2,4,5-triphenylimidazole}, Thermochimica Acta, 2007, 456, 2, 114-119, https://doi.org/10.1016/j.tca.2007.02.005 . [all data]